Unable install SendMail For OpenEmm [FIXED]

OpenEMM is a feature-rich web-based enterprise application for email marketing, newsletters and service mails (transaction mails and event or time triggered mails). OpenEMM offers a great user interface, sophisticated bounce management, link tracking, lots of graphical realtime statistics, a CMS module and a scripting feature to implement individual tasks.

Unable install SendMail For OpenEmm [FIXED]

New postby Friend7 » Mon Aug 01, 2011 5:42 pm

Bonjour,

I cannot install the new OpenEmm.

I have tried many times.

Maybe .. the old OpenEMM service does not allow me to install the new one.

Cached was cleaned and "Refresh index file" was done as well.

Cordialement

Image

Image
Last edited by Friend7 on Mon Aug 01, 2011 11:31 pm, edited 2 times in total.
Best Regards,
Friend7
 
Posts: 2373
Joined: Sun Feb 06, 2011 3:41 pm
Artica servers number: 1
Linux System: Debian
Technical skills: A newbee

Re: Unable install the new OpenEmm [OPEN]

New postby admin » Mon Aug 01, 2011 6:18 pm

what is the result of

Code: Select all
/usr/share/artica-postfix/bin/artica-make APP_OPENEMM_SENDMAIL
User avatar
admin
Site Admin
 
Posts: 11942
Joined: Wed Oct 17, 2007 7:59 am
Location: France

Re: Unable install the new OpenEmm [OPEN]

New postby Friend7 » Mon Aug 01, 2011 7:15 pm

Code: Select all
tatistics
cc -O2 -I. -I../../include  -DNEWDB  -DSASL      -c -o main.o main.c
In file included from main.c:15:
./sendmail.h:138:20: error: sasl.h: No such file or directory
./sendmail.h:139:24: error: saslutil.h: No such file or directory
In file included from main.c:15:
./sendmail.h:154: error: expected '=', ',', ';', 'asm' or '__attribute__' before
'README'
./sendmail.h:212: warning: data definition has no type or storage class
./sendmail.h:607: error: expected '=', ',', ';', 'asm' or '__attribute__' before
':' token
In file included from main.c:15:
./sendmail.h:691: error: expected specifier-qualifier-list before 'sasl_conn_t'
./sendmail.h:1104: error: expected declaration specifiers or '...' before 'ARGCL
ASS_T'
main.c:110: error: expected '=', ',', ';', 'asm' or '__attribute__' before 'srvc
allbacks'
main.c: In function 'main':
main.c:708: error: 'A_PERM' undeclared (first use in this function)
main.c:708: error: (Each undeclared identifier is reported only once
main.c:708: error: for each function it appears in.)
main.c:708: warning: passing argument 3 of 'macdefine_tagged' makes pointer from
integer without a cast
./sendmail.h:1104: note: expected 'char *' but argument is of type 'int'
main.c:708: warning: passing argument 5 of 'macdefine_tagged' makes integer from
pointer without a cast
./sendmail.h:1104: note: expected 'int' but argument is of type 'char *'
main.c:708: error: too many arguments to function 'macdefine_tagged'
main.c:718: error: 'A_TEMP' undeclared (first use in this function)
main.c:718: warning: passing argument 3 of 'macdefine_tagged' makes pointer from
integer without a cast
./sendmail.h:1104: note: expected 'char *' but argument is of type 'int'
main.c:718: warning: passing argument 5 of 'macdefine_tagged' makes integer from
pointer without a cast
./sendmail.h:1104: note: expected 'int' but argument is of type 'char *'
main.c:718: error: too many arguments to function 'macdefine_tagged'
main.c:719: warning: passing argument 3 of 'macdefine_tagged' makes pointer from
integer without a cast
./sendmail.h:1104: note: expected 'char *' but argument is of type 'int'
main.c:719: warning: passing argument 5 of 'macdefine_tagged' makes integer from
pointer without a cast
./sendmail.h:1104: note: expected 'int' but argument is of type 'char *'
main.c:719: error: too many arguments to function 'macdefine_tagged'
main.c:724: warning: passing argument 3 of 'macdefine_tagged' makes pointer from
integer without a cast
./sendmail.h:1104: note: expected 'char *' but argument is of type 'int'
main.c:724: warning: passing argument 5 of 'macdefine_tagged' makes integer from
pointer without a cast
./sendmail.h:1104: note: expected 'int' but argument is of type 'char *'
main.c:724: error: too many arguments to function 'macdefine_tagged'
main.c:738: warning: passing argument 3 of 'macdefine_tagged' makes pointer from
integer without a cast
./sendmail.h:1104: note: expected 'char *' but argument is of type 'int'
main.c:738: warning: passing argument 5 of 'macdefine_tagged' makes integer from
pointer without a cast
./sendmail.h:1104: note: expected 'int' but argument is of type 'char *'
main.c:738: error: too many arguments to function 'macdefine_tagged'
main.c:805: warning: passing argument 3 of 'macdefine_tagged' makes pointer from
integer without a cast
./sendmail.h:1104: note: expected 'char *' but argument is of type 'int'
main.c:805: warning: passing argument 5 of 'macdefine_tagged' makes integer from
pointer without a cast
./sendmail.h:1104: note: expected 'int' but argument is of type 'char *'
main.c:805: error: too many arguments to function 'macdefine_tagged'
main.c:885: warning: passing argument 3 of 'macdefine_tagged' makes pointer from
integer without a cast
./sendmail.h:1104: note: expected 'char *' but argument is of type 'int'
main.c:885: warning: passing argument 5 of 'macdefine_tagged' makes integer from
pointer without a cast
./sendmail.h:1104: note: expected 'int' but argument is of type 'char *'
main.c:885: error: too many arguments to function 'macdefine_tagged'
main.c:906: warning: passing argument 3 of 'macdefine_tagged' makes pointer from
integer without a cast
./sendmail.h:1104: note: expected 'char *' but argument is of type 'int'
main.c:906: warning: passing argument 5 of 'macdefine_tagged' makes integer from
pointer without a cast
./sendmail.h:1104: note: expected 'int' but argument is of type 'char *'
main.c:906: error: too many arguments to function 'macdefine_tagged'
main.c:949: error: 'A_HEAP' undeclared (first use in this function)
main.c:949: warning: passing argument 3 of 'macdefine_tagged' makes pointer from
integer without a cast
./sendmail.h:1104: note: expected 'char *' but argument is of type 'int'
main.c:949: warning: passing argument 5 of 'macdefine_tagged' makes integer from
pointer without a cast
./sendmail.h:1104: note: expected 'int' but argument is of type 'char *'
main.c:949: error: too many arguments to function 'macdefine_tagged'
main.c:958: warning: passing argument 3 of 'macdefine_tagged' makes pointer from
integer without a cast
./sendmail.h:1104: note: expected 'char *' but argument is of type 'int'
main.c:958: warning: passing argument 5 of 'macdefine_tagged' makes integer from
pointer without a cast
./sendmail.h:1104: note: expected 'int' but argument is of type 'char *'
main.c:958: error: too many arguments to function 'macdefine_tagged'
main.c:1110: warning: passing argument 3 of 'macdefine_tagged' makes pointer fro
m integer without a cast
./sendmail.h:1104: note: expected 'char *' but argument is of type 'int'
main.c:1110: warning: passing argument 5 of 'macdefine_tagged' makes integer fro
m pointer without a cast
./sendmail.h:1104: note: expected 'int' but argument is of type 'char *'
main.c:1110: error: too many arguments to function 'macdefine_tagged'
main.c:1129: warning: passing argument 3 of 'macdefine_tagged' makes pointer fro
m integer without a cast
./sendmail.h:1104: note: expected 'char *' but argument is of type 'int'
main.c:1129: warning: passing argument 5 of 'macdefine_tagged' makes integer fro
m pointer without a cast
./sendmail.h:1104: note: expected 'int' but argument is of type 'char *'
main.c:1129: error: too many arguments to function 'macdefine_tagged'
main.c:1212: warning: passing argument 3 of 'macdefine_tagged' makes pointer fro
m integer without a cast
./sendmail.h:1104: note: expected 'char *' but argument is of type 'int'
main.c:1212: warning: passing argument 5 of 'macdefine_tagged' makes integer fro
m pointer without a cast
./sendmail.h:1104: note: expected 'int' but argument is of type 'char *'
main.c:1212: error: too many arguments to function 'macdefine_tagged'
main.c:1221: warning: passing argument 3 of 'macdefine_tagged' makes pointer fro
m integer without a cast
./sendmail.h:1104: note: expected 'char *' but argument is of type 'int'
main.c:1221: warning: passing argument 5 of 'macdefine_tagged' makes integer fro
m pointer without a cast
./sendmail.h:1104: note: expected 'int' but argument is of type 'char *'
main.c:1221: error: too many arguments to function 'macdefine_tagged'
main.c:1390: warning: passing argument 3 of 'macdefine_tagged' makes pointer fro
m integer without a cast
./sendmail.h:1104: note: expected 'char *' but argument is of type 'int'
main.c:1390: warning: passing argument 5 of 'macdefine_tagged' makes integer fro
m pointer without a cast
./sendmail.h:1104: note: expected 'int' but argument is of type 'char *'
main.c:1390: error: too many arguments to function 'macdefine_tagged'
main.c:2043: warning: passing argument 3 of 'macdefine_tagged' makes pointer fro
m integer without a cast
./sendmail.h:1104: note: expected 'char *' but argument is of type 'int'
main.c:2043: warning: passing argument 5 of 'macdefine_tagged' makes integer fro
m pointer without a cast
./sendmail.h:1104: note: expected 'int' but argument is of type 'char *'
main.c:2043: error: too many arguments to function 'macdefine_tagged'
main.c:2046: warning: passing argument 3 of 'macdefine_tagged' makes pointer fro
m integer without a cast
./sendmail.h:1104: note: expected 'char *' but argument is of type 'int'
main.c:2046: warning: passing argument 5 of 'macdefine_tagged' makes integer fro
m pointer without a cast
./sendmail.h:1104: note: expected 'int' but argument is of type 'char *'
main.c:2046: error: too many arguments to function 'macdefine_tagged'
main.c:2049: warning: passing argument 3 of 'macdefine_tagged' makes pointer fro
m integer without a cast
./sendmail.h:1104: note: expected 'char *' but argument is of type 'int'
main.c:2049: warning: passing argument 5 of 'macdefine_tagged' makes integer fro
m pointer without a cast
./sendmail.h:1104: note: expected 'int' but argument is of type 'char *'
main.c:2049: error: too many arguments to function 'macdefine_tagged'
main.c:2092: warning: passing argument 3 of 'macdefine_tagged' makes pointer fro
m integer without a cast
./sendmail.h:1104: note: expected 'char *' but argument is of type 'int'
main.c:2092: warning: passing argument 5 of 'macdefine_tagged' makes integer fro
m pointer without a cast
./sendmail.h:1104: note: expected 'int' but argument is of type 'char *'
main.c:2092: error: too many arguments to function 'macdefine_tagged'
main.c:2286: error: 'srvcallbacks' undeclared (first use in this function)
main.c:2286: error: 'SASL_OK' undeclared (first use in this function)
main.c:2371: warning: passing argument 3 of 'macdefine_tagged' makes pointer fro
m integer without a cast
./sendmail.h:1104: note: expected 'char *' but argument is of type 'int'
main.c:2371: warning: passing argument 5 of 'macdefine_tagged' makes integer fro
m pointer without a cast
./sendmail.h:1104: note: expected 'int' but argument is of type 'char *'
main.c:2371: error: too many arguments to function 'macdefine_tagged'
main.c:2375: warning: passing argument 3 of 'macdefine_tagged' makes pointer fro
m integer without a cast
./sendmail.h:1104: note: expected 'char *' but argument is of type 'int'
main.c:2375: warning: passing argument 5 of 'macdefine_tagged' makes integer fro
m pointer without a cast
./sendmail.h:1104: note: expected 'int' but argument is of type 'char *'
main.c:2375: error: too many arguments to function 'macdefine_tagged'
main.c:2563: warning: passing argument 3 of 'macdefine_tagged' makes pointer fro
m integer without a cast
./sendmail.h:1104: note: expected 'char *' but argument is of type 'int'
main.c:2563: warning: passing argument 5 of 'macdefine_tagged' makes integer fro
m pointer without a cast
./sendmail.h:1104: note: expected 'int' but argument is of type 'char *'
main.c:2563: error: too many arguments to function 'macdefine_tagged'
main.c:2596: warning: passing argument 3 of 'macdefine_tagged' makes pointer fro
m integer without a cast
./sendmail.h:1104: note: expected 'char *' but argument is of type 'int'
main.c:2596: warning: passing argument 5 of 'macdefine_tagged' makes integer fro
m pointer without a cast
./sendmail.h:1104: note: expected 'int' but argument is of type 'char *'
main.c:2596: error: too many arguments to function 'macdefine_tagged'
main.c:2600: warning: passing argument 3 of 'macdefine_tagged' makes pointer fro
m integer without a cast
./sendmail.h:1104: note: expected 'char *' but argument is of type 'int'
main.c:2600: warning: passing argument 5 of 'macdefine_tagged' makes integer fro
m pointer without a cast
./sendmail.h:1104: note: expected 'int' but argument is of type 'char *'
main.c:2600: error: too many arguments to function 'macdefine_tagged'
main.c:2602: warning: passing argument 3 of 'macdefine_tagged' makes pointer fro
m integer without a cast
./sendmail.h:1104: note: expected 'char *' but argument is of type 'int'
main.c:2602: warning: passing argument 5 of 'macdefine_tagged' makes integer fro
m pointer without a cast
./sendmail.h:1104: note: expected 'int' but argument is of type 'char *'
main.c:2602: error: too many arguments to function 'macdefine_tagged'
main.c:2604: warning: passing argument 3 of 'macdefine_tagged' makes pointer fro
m integer without a cast
./sendmail.h:1104: note: expected 'char *' but argument is of type 'int'
main.c:2604: warning: passing argument 5 of 'macdefine_tagged' makes integer fro
m pointer without a cast
./sendmail.h:1104: note: expected 'int' but argument is of type 'char *'
main.c:2604: error: too many arguments to function 'macdefine_tagged'
main.c:2626: warning: passing argument 3 of 'macdefine_tagged' makes pointer fro
m integer without a cast
./sendmail.h:1104: note: expected 'char *' but argument is of type 'int'
main.c:2626: warning: passing argument 5 of 'macdefine_tagged' makes integer fro
m pointer without a cast
./sendmail.h:1104: note: expected 'int' but argument is of type 'char *'
main.c:2626: error: too many arguments to function 'macdefine_tagged'
main.c:2687: warning: passing argument 3 of 'macdefine_tagged' makes pointer fro
m integer without a cast
./sendmail.h:1104: note: expected 'char *' but argument is of type 'int'
main.c:2687: warning: passing argument 5 of 'macdefine_tagged' makes integer fro
m pointer without a cast
./sendmail.h:1104: note: expected 'int' but argument is of type 'char *'
main.c:2687: error: too many arguments to function 'macdefine_tagged'
main.c:2688: warning: passing argument 3 of 'macdefine_tagged' makes pointer fro
m integer without a cast
./sendmail.h:1104: note: expected 'char *' but argument is of type 'int'
main.c:2688: warning: passing argument 5 of 'macdefine_tagged' makes integer fro
m pointer without a cast
./sendmail.h:1104: note: expected 'int' but argument is of type 'char *'
main.c:2688: error: too many arguments to function 'macdefine_tagged'
main.c:2727: warning: passing argument 3 of 'macdefine_tagged' makes pointer fro
m integer without a cast
./sendmail.h:1104: note: expected 'char *' but argument is of type 'int'
main.c:2727: warning: passing argument 5 of 'macdefine_tagged' makes integer fro
m pointer without a cast
./sendmail.h:1104: note: expected 'int' but argument is of type 'char *'
main.c:2727: error: too many arguments to function 'macdefine_tagged'
main.c:2831: warning: passing argument 3 of 'macdefine_tagged' makes pointer fro
m integer without a cast
./sendmail.h:1104: note: expected 'char *' but argument is of type 'int'
main.c:2831: warning: passing argument 5 of 'macdefine_tagged' makes integer fro
m pointer without a cast
./sendmail.h:1104: note: expected 'int' but argument is of type 'char *'
main.c:2831: error: too many arguments to function 'macdefine_tagged'
main.c: In function 'testmodeline':
main.c:4083: error: 'A_TEMP' undeclared (first use in this function)
main.c:4083: warning: passing argument 3 of 'macdefine_tagged' makes pointer fro
m integer without a cast
./sendmail.h:1104: note: expected 'char *' but argument is of type 'int'
main.c:4083: warning: passing argument 5 of 'macdefine_tagged' makes integer fro
m pointer without a cast
./sendmail.h:1104: note: expected 'int' but argument is of type 'char *'
main.c:4083: error: too many arguments to function 'macdefine_tagged'
main.c:4431: warning: passing argument 3 of 'macdefine_tagged' makes pointer fro
m integer without a cast
./sendmail.h:1104: note: expected 'char *' but argument is of type 'int'
main.c:4431: warning: passing argument 5 of 'macdefine_tagged' makes integer fro
m pointer without a cast
./sendmail.h:1104: note: expected 'int' but argument is of type 'char *'
main.c:4431: error: too many arguments to function 'macdefine_tagged'
make: *** [main.o] Error 1
root@server:~# Shutdown artica-status daemon...
Stopping Artica-status.......: 9731 PID..
Shutdown artica-exec daemon...
Stopping Artica-executor.....: 9757 PID..
killing shared memory entry 360448
/usr/bin/ipcrm: invalid id (360448)
killing shared memory entry 393217
/usr/bin/ipcrm: invalid id (393217)
killing shared memory entry 294914
/usr/bin/ipcrm: invalid id (294914)
killing shared memory entry 163843
/usr/bin/ipcrm: invalid id (163843)
killing shared memory entry 196612
/usr/bin/ipcrm: invalid id (196612)
killing shared memory entry 229381
/usr/bin/ipcrm: invalid id (229381)
killing shared memory entry 425990
/usr/bin/ipcrm: invalid id (425990)
killing shared memory entry 458759
/usr/bin/ipcrm: invalid id (458759)
Cleaned language "fr" 0 KB bytes
Cleaned language "en" 0 KB bytes
Cleaned language "po" 0 KB bytes
Cleaned language "es" 0 KB bytes
Cleaned language "it" 0 KB bytes
Stopping Artica-status.......: 0 childrens.
Stopping Artica-status.......: success
Cleaned language "br" 0 KB bytes
Cleaned language "pol" 0 KB bytes
Stopping Artica-executor.....: 0 childrens.
Stopping Artica-executor.....: success
Starting......: postfix authentication mechanisms: LOGIN PLAIN
Starting......: postfix creating /etc/postfix/sasl/smtpd.conf
Starting......: saslpasswd: /usr/sbin/saslpasswd2
Starting......: artica-status Memory 5120MB
Starting......: artica-status fork()ed successfully.
Starting......: Artica-status started with new PID 19477
Starting......: artica-executor fork()ed successfully.
Starting......: Artica-executor started with new PID 19489

root@server:~#

Best Regards,
Friend7
 
Posts: 2373
Joined: Sun Feb 06, 2011 3:41 pm
Artica servers number: 1
Linux System: Debian
Technical skills: A newbee

Re: Unable install the new OpenEmm [OPEN]

New postby Friend7 » Mon Aug 01, 2011 7:22 pm

Image
Best Regards,
Friend7
 
Posts: 2373
Joined: Sun Feb 06, 2011 3:41 pm
Artica servers number: 1
Linux System: Debian
Technical skills: A newbee

Re: Unable install the new OpenEmm [OPEN]

New postby admin » Mon Aug 01, 2011 8:51 pm

do

Code: Select all
apt-get install libsasl2-dev


and restart the compilation
User avatar
admin
Site Admin
 
Posts: 11942
Joined: Wed Oct 17, 2007 7:59 am
Location: France

Re: Unable install the new OpenEmm [OPEN]

New postby Friend7 » Mon Aug 01, 2011 8:53 pm

Code: Select all
root@server:~# apt-get install libsasl2-dev
Reading package lists... Done
Building dependency tree
Reading state information... Done

libsasl2-dev is already the newest version.

0 upgraded, 0 newly installed, 0 to remove and 4 not upgraded.
1 not fully installed or removed.
After this operation, 0 B of additional disk space will be used.
Do you want to continue [Y/n]? y
Setting up nfs-common (1:1.2.2-4) ...
insserv: warning: script 'K01postfix' missing LSB tags and overrides
insserv: Service portmap has to be enabled to start service nfs-common
insserv: exiting now!
update-rc.d: error: insserv rejected the script header
dpkg: error processing nfs-common (--configure):
subprocess installed post-installation script returned error exit status 1
configured to not write apport reports
                                      Errors were encountered while processing:
nfs-common
E: Sub-process /usr/bin/dpkg returned an error code (1)
root@server:~#

Best Regards,
Friend7
 
Posts: 2373
Joined: Sun Feb 06, 2011 3:41 pm
Artica servers number: 1
Linux System: Debian
Technical skills: A newbee

Re: Unable install the new OpenEmm [CLOSED]

New postby Friend7 » Mon Aug 01, 2011 11:28 pm

/usr/share/artica-postfix/bin/artica-make APP_OPENEMM

/usr/share/artica-postfix/bin/artica-make APP_OPENEMM_SENDMAIL

/etc.init.d/artica-postfix restart openemm-sendmail
Best Regards,
Friend7
 
Posts: 2373
Joined: Sun Feb 06, 2011 3:41 pm
Artica servers number: 1
Linux System: Debian
Technical skills: A newbee

Re: Unable install the new OpenEmm [OPEN]

New postby Friend7 » Mon Aug 01, 2011 11:33 pm

Image

Image
Best Regards,
Friend7
 
Posts: 2373
Joined: Sun Feb 06, 2011 3:41 pm
Artica servers number: 1
Linux System: Debian
Technical skills: A newbee

Re: Unable install the new OpenEmm [OPEN]

New postby admin » Tue Aug 02, 2011 3:55 pm

fixed
User avatar
admin
Site Admin
 
Posts: 11942
Joined: Wed Oct 17, 2007 7:59 am
Location: France


Return to OpenEMM

Who is online

Users browsing this forum: No registered users and 0 guests

cron